Reaction Details
TargetNociceptin receptor
LigandBDBM50153136
Substrate/Competitorn/a
Meas. Tech.ChEMBL_310609 (CHEMBL837187)
Ki 9535±n/a nM
Citation Goehring, RRWhitehead, JFBrown, KIslam, KWen, XZhou, XChen, ZValenzano, KJMiller, WSShan, SKyle, DJ 1,3-Dihydro-2,1,3-benzothiadiazol-2,2-diones and 3,4-dihydro-1H-2,1,3-benzothidiazin-2,2-diones as ligands for the NOP receptor. Bioorg Med Chem Lett14:5045-50 (2004) 
 
Nociceptin receptor
Name:Nociceptin receptor
Type:G Protein-Coupled Receptor (GPCR)
Mol. Mass.:40702.87
Organism:Homo sapiens (Human)
Description:P41146
Residue:370
BDBM50153136
NameBDBM50153136
Synonyms:1-(1-Biphenyl-4-ylmethyl-piperidin-4-yl)-3,4-dihydro-1H-benzo[1,2,6]thiadiazine 2,2-dioxide | CHEMBL187907
TypeSmall organic molecule
Emp. Form.C25H27N3O2S
Mol. Mass.433.566
SMILESO=S1(=O)NCc2ccccc2N1C1CCN(Cc2ccc(cc2)-c2ccccc2)CC1