Reaction Details
TargetNociceptin receptor
LigandBDBM50153149
Substrate/Competitorn/a
Meas. Tech.ChEMBL_310609 (CHEMBL837187)
Ki 5102±n/a nM
Citation Goehring, RRWhitehead, JFBrown, KIslam, KWen, XZhou, XChen, ZValenzano, KJMiller, WSShan, SKyle, DJ 1,3-Dihydro-2,1,3-benzothiadiazol-2,2-diones and 3,4-dihydro-1H-2,1,3-benzothidiazin-2,2-diones as ligands for the NOP receptor. Bioorg Med Chem Lett14:5045-50 (2004) 
 
Nociceptin receptor
Name:Nociceptin receptor
Type:G Protein-Coupled Receptor (GPCR)
Mol. Mass.:40702.87
Organism:Homo sapiens (Human)
Description:P41146
Residue:370
BDBM50153149
NameBDBM50153149
Synonyms:1-[1-(4-Propyl-cyclohexyl)-piperidin-4-yl]-1,3-dihydro-benzo[1,2,5]thiadiazole 2,2-dioxide | CHEMBL183464
TypeSmall organic molecule
Emp. Form.C20H31N3O2S
Mol. Mass.377.544
SMILESCCCC1CCC(CC1)N1CCC(CC1)N1c2ccccc2NS1(=O)=O