Reaction Details
TargetTyrosine-protein phosphatase non-receptor type 1
LigandBDBM50370424
Substrate/Competitorn/a
Meas. Tech.ChEMBL_303534 (CHEMBL839648)
Ki 11000±n/a nM
Citation Lovering, FAngell, YZhang, YLBridges, K Development of a polyvalent assay system for lead identification. Bioorg Med Chem Lett14:5081-3 (2004) 
 
Tyrosine-protein phosphatase non-receptor type 1
Name:Tyrosine-protein phosphatase non-receptor type 1
Type:Protein phosphatase
Mol. Mass.:49963.76
Organism:Homo sapiens (Human)
Description:Human recombinant GST-fusion PTP1B (1-435).
Residue:435
BDBM50370424
NameBDBM50370424
Synonyms:CHEMBL1791292
TypeSmall organic molecule
Emp. Form.C30H44N8O12
Mol. Mass.708.7168
SMILES[#6]-[#6]-[#6@@H](-[#6])-[#6@H](-[#7]-[#6](=O)-[#6](-[#6]-c1ccc(-[#8]-[#6]-[#6](-[#8])=O)c(c1)-[#6](-[#8])=O)-[#7]-[#6](=O)-[#6@H](-[#6]-[#6](-[#8])=O)-[#7]-[#6](-[#6])=O)-[#6](=O)-[#7]-[#6@@H](-[#6]-[#6]-[#6]\[#7]=[#6](/[#7])-[#7])-[#6](-[#7])=O