Reaction Details
TargetAndrogen receptor
LigandBDBM50153639
Substrate/Competitorn/a
Meas. Tech.ChEMBL_303025 (CHEMBL830413)
Ki 2±n/a nM
Citation Van Dort, MEJung, YW Synthesis and structure-activity investigation of iodinated arylhydantoins and arylthiohydantoins for development as androgen receptor radioligands. Bioorg Med Chem Lett14:5285-8 (2004) 
 
Androgen receptor
Name:Androgen receptor
Type:Enzyme
Mol. Mass.:98219.08
Organism:Rattus norvegicus (Rat)
Description:P15207
Residue:902
BDBM50153639
NameBDBM50153639
Synonyms:4-[3-(4-Hydroxy-butyl)-4,4-dimethyl-2,5-dioxo-imidazolidin-1-yl]-2-iodo-benzonitrile | CHEMBL187251
TypeSmall organic molecule
Emp. Form.C16H18IN3O3
Mol. Mass.427.2369
SMILESCC1(C)N(CCCCO)C(=O)N(C1=O)c1ccc(C#N)c(I)c1