Reaction Details
TargetAndrogen receptor
LigandBDBM50091400
Substrate/Competitorn/a
Meas. Tech.ChEMBL_303025 (CHEMBL830413)
Ki 2.23±n/a nM
Citation Van Dort, MEJung, YW Synthesis and structure-activity investigation of iodinated arylhydantoins and arylthiohydantoins for development as androgen receptor radioligands. Bioorg Med Chem Lett14:5285-8 (2004) 
 
Androgen receptor
Name:Androgen receptor
Type:Enzyme
Mol. Mass.:98219.08
Organism:Rattus norvegicus (Rat)
Description:P15207
Residue:902
BDBM50091400
NameBDBM50091400
Synonyms:4-(3-(4-hydroxybutyl)-4,4-dimethyl-5-oxo-2-thioxoimidazolidin-1-yl)-2-(trifluoromethyl)benzonitrile CHEMBL331820 | RU-59063
TypeSmall organic molecule
Emp. Form.C17H18F3N3O2S
Mol. Mass.385.404
SMILESCC1(C)N(CCCCO)C(=S)N(C1=O)c1ccc(C#N)c(c1)C(F)(F)F