Reaction Details
TargetHistone deacetylase 1
LigandBDBM19130
Substrate/Competitorn/a
Meas. Tech.ChEMBL_304811 (CHEMBL827901)
IC50 20±n/a nM
Citation Jose, BOniki, YKato, TNishino, NSumida, YYoshida, M Novel histone deacetylase inhibitors: cyclic tetrapeptide with trifluoromethyl and pentafluoroethyl ketones. Bioorg Med Chem Lett14:5343-6 (2004) 
 
Histone deacetylase 1
Name:Histone deacetylase 1
Type:Enzyme
Mol. Mass.:55090.27
Organism:Homo sapiens (Human)
Description:Q13547
Residue:482
BDBM19130
NameBDBM19130
Synonyms:(2E,4E,6R)-7-[4-(dimethylamino)phenyl]-N-hydroxy-4,6-dimethyl-7-oxohepta-2,4-dienamide TSA | Trichostatin A (TSA)
TypeSmall organic molecule
Emp. Form.C17H22N2O3
Mol. Mass.302.3682
SMILESCC(C=CC(=O)NO)C=C(C)C(=O)c1ccc(cc1)N(C)C