Reaction Details
TargetCarbonic anhydrase 2
LigandBDBM10890
Substrate/Competitorn/a
Meas. Tech.ChEMBL_302881 (CHEMBL828795)
Ki 15±n/a nM
Citation Garaj, VPuccetti, LFasolis, GWinum, JYMontero, JLScozzafava, AVullo, DInnocenti, ASupuran, CT Carbonic anhydrase inhibitors: synthesis and inhibition of cytosolic/tumor-associated carbonic anhydrase isozymes I, II, and IX with sulfonamides incorporating 1,2,4-triazine moieties. Bioorg Med Chem Lett14:5427-33 (2004) 
 
Carbonic anhydrase 2
Name:Carbonic anhydrase 2
Type:Enzyme
Mol. Mass.:29250.71
Organism:Homo sapiens (Human)
Description:P00918
Residue:260
BDBM10890
NameBDBM10890
Synonyms:1-N-(3-chloro-1H-indol-7-yl)benzene-1,4-disulfonamide Compound 6 Indisulam (IND) | Sulfonamide, 7
TypeSmall organic molecule
Emp. Form.C14H12ClN3O4S2
Mol. Mass.385.846
SMILESNS(=O)(=O)c1ccc(cc1)S(=O)(=O)Nc1cccc2c(Cl)c[nH]c12