Reaction Details
TargetCarbonic anhydrase 1
LigandBDBM50153970
Substrate/Competitorn/a
Meas. Tech.ChEMBL_302864 (CHEMBL828779)
Ki 78±n/a nM
Citation Garaj, VPuccetti, LFasolis, GWinum, JYMontero, JLScozzafava, AVullo, DInnocenti, ASupuran, CT Carbonic anhydrase inhibitors: synthesis and inhibition of cytosolic/tumor-associated carbonic anhydrase isozymes I, II, and IX with sulfonamides incorporating 1,2,4-triazine moieties. Bioorg Med Chem Lett14:5427-33 (2004) 
 
Carbonic anhydrase 1
Name:Carbonic anhydrase 1
Type:Enzyme
Mol. Mass.:28873.37
Organism:Homo sapiens (Human)
Description:P00915
Residue:261
BDBM50153970
NameBDBM50153970
Synonyms:4-(4,6-Diethoxy-[1,3,5]triazin-2-ylamino)-benzenesulfonamide | CHEMBL363543
TypeSmall organic molecule
Emp. Form.C13H17N5O4S
Mol. Mass.339.37
SMILESCCOc1nc(Nc2ccc(cc2)S(N)(=O)=O)nc(OCC)n1