Reaction Details
TargetCarbonic anhydrase 1
LigandBDBM50153973
Substrate/Competitorn/a
Meas. Tech.ChEMBL_302864 (CHEMBL828779)
Ki 75±n/a nM
Citation Garaj, VPuccetti, LFasolis, GWinum, JYMontero, JLScozzafava, AVullo, DInnocenti, ASupuran, CT Carbonic anhydrase inhibitors: synthesis and inhibition of cytosolic/tumor-associated carbonic anhydrase isozymes I, II, and IX with sulfonamides incorporating 1,2,4-triazine moieties. Bioorg Med Chem Lett14:5427-33 (2004) 
 
Carbonic anhydrase 1
Name:Carbonic anhydrase 1
Type:Enzyme
Mol. Mass.:28873.37
Organism:Homo sapiens (Human)
Description:P00915
Residue:261
BDBM50153973
NameBDBM50153973
Synonyms:4-[2-(4,6-Dichloro-[1,3,5]triazin-2-ylamino)-ethyl]-benzenesulfonamide | CHEMBL187274
TypeSmall organic molecule
Emp. Form.C11H11Cl2N5O2S
Mol. Mass.348.208
SMILESNS(=O)(=O)c1ccc(CCNc2nc(Cl)nc(Cl)n2)cc1