Reaction Details
Target5-hydroxytryptamine receptor 4
LigandBDBM50155152
Substrate/Competitorn/a
Meas. Tech.ChEMBL_303510 (CHEMBL838624)
Ki 57±n/a nM
Citation Becker, DPFlynn, DLShone, RLGullikson, G Azaadamantane benzamide 5-HT4 agonists: gastrointestinal prokinetic SC-54750. Bioorg Med Chem Lett14:5509-12 (2004) 
 
5-hydroxytryptamine receptor 4
Name:5-hydroxytryptamine receptor 4
Type:Enzyme Catalytic Domain
Mol. Mass.:46117.31
Organism:RAT
Description:5-HT4 HTR4 RAT::Q62758
Residue:406
BDBM50155152
NameBDBM50155152
Synonyms:4-Amino-N-(1-aza-tricyclo[3.3.1.1*3,7*]dec-4-yl)-5-chloro-2-methoxy-benzamide CHEMBL295155 | SC-51718
TypeSmall organic molecule
Emp. Form.C17H22ClN3O2
Mol. Mass.335.828
SMILESCOc1cc(N)c(Cl)cc1C(=O)NC1C2CC3CC1CN(C3)C2