Reaction Details
TargetCarbonic anhydrase 9
LigandBDBM50155542
Substrate/Competitorn/a
Meas. Tech.ChEMBL_302868 (CHEMBL828783)
Ki 13±n/a nM
Citation Cecchi, AWinum, JYInnocenti, AVullo, DMontero, JLScozzafava, ASupuran, CT Carbonic anhydrase inhibitors: synthesis and inhibition of cytosolic/tumor-associated carbonic anhydrase isozymes I, II, and IX with sulfonamides derived from 4-isothiocyanato-benzolamide. Bioorg Med Chem Lett14:5775-80 (2004) 
 
Carbonic anhydrase 9
Name:Carbonic anhydrase 9
Type:Enzyme
Mol. Mass.:49669.03
Organism:Homo sapiens (Human)
Description:Catalytic domain of human cloned isozyme was used in the assay
Residue:459
BDBM50155542
NameBDBM50155542
Synonyms:5-{4-[3-(2-Dimethylamino-ethyl)-thioureido]-benzenesulfonylamino}-[1,3,4]thiadiazole-2-sulfonic acid amide | CHEMBL362499
TypeSmall organic molecule
Emp. Form.C13H19N7O4S4
Mol. Mass.465.594
SMILESCN(C)CCNC(=S)Nc1ccc(cc1)S(=O)(=O)Nc1nnc(s1)S(N)(=O)=O