Reaction Details
TargetCarbonic anhydrase 2
LigandBDBM50155541
Substrate/Competitorn/a
Meas. Tech.ChEMBL_302866 (CHEMBL828781)
Ki 0.9±n/a nM
Citation Cecchi, AWinum, JYInnocenti, AVullo, DMontero, JLScozzafava, ASupuran, CT Carbonic anhydrase inhibitors: synthesis and inhibition of cytosolic/tumor-associated carbonic anhydrase isozymes I, II, and IX with sulfonamides derived from 4-isothiocyanato-benzolamide. Bioorg Med Chem Lett14:5775-80 (2004) 
 
Carbonic anhydrase 2
Name:Carbonic anhydrase 2
Type:Enzyme
Mol. Mass.:29250.71
Organism:Homo sapiens (Human)
Description:P00918
Residue:260
BDBM50155541
NameBDBM50155541
Synonyms:Aminobenzolamide derivative | CHEMBL435094
TypeSmall organic molecule
Emp. Form.C28H38N14O8S8
Mol. Mass.955.21
SMILESNS(=O)(=O)c1nnc(NS(=O)(=O)c2ccc(NC(=S)NCCCN3CCN(CCCNC(=S)Nc4ccc(cc4)S(=O)(=O)Nc4nnc(s4)S(N)(=O)=O)CC3)cc2)s1