Reaction Details
TargetCarbonic anhydrase 2
LigandBDBM50155543
Substrate/Competitorn/a
Meas. Tech.ChEMBL_302866 (CHEMBL828781)
Ki 0.5±n/a nM
Citation Cecchi, AWinum, JYInnocenti, AVullo, DMontero, JLScozzafava, ASupuran, CT Carbonic anhydrase inhibitors: synthesis and inhibition of cytosolic/tumor-associated carbonic anhydrase isozymes I, II, and IX with sulfonamides derived from 4-isothiocyanato-benzolamide. Bioorg Med Chem Lett14:5775-80 (2004) 
 
Carbonic anhydrase 2
Name:Carbonic anhydrase 2
Type:Enzyme
Mol. Mass.:29250.71
Organism:Homo sapiens (Human)
Description:P00918
Residue:260
BDBM50155543
NameBDBM50155543
Synonyms:5-{4-[3-(2-Fluoro-phenyl)-thioureido]-benzenesulfonylamino}-[1,3,4]thiadiazole-2-sulfonic acid amide | CHEMBL427329
TypeSmall organic molecule
Emp. Form.C15H13FN6O4S4
Mol. Mass.488.56
SMILESNS(=O)(=O)c1nnc(NS(=O)(=O)c2ccc(NC(=S)Nc3ccccc3F)cc2)s1