Reaction Details
TargetCarbonic anhydrase 2
LigandBDBM50155544
Substrate/Competitorn/a
Meas. Tech.ChEMBL_302866 (CHEMBL828781)
Ki 0.9±n/a nM
Citation Cecchi, AWinum, JYInnocenti, AVullo, DMontero, JLScozzafava, ASupuran, CT Carbonic anhydrase inhibitors: synthesis and inhibition of cytosolic/tumor-associated carbonic anhydrase isozymes I, II, and IX with sulfonamides derived from 4-isothiocyanato-benzolamide. Bioorg Med Chem Lett14:5775-80 (2004) 
 
Carbonic anhydrase 2
Name:Carbonic anhydrase 2
Type:Enzyme
Mol. Mass.:29250.71
Organism:Homo sapiens (Human)
Description:P00918
Residue:260
BDBM50155544
NameBDBM50155544
Synonyms:5-[4-(3-Morpholin-4-yl-thioureido)-benzenesulfonylamino]-[1,3,4]thiadiazole-2-sulfonic acid amide | CHEMBL187259
TypeSmall organic molecule
Emp. Form.C13H17N7O5S4
Mol. Mass.479.578
SMILESNS(=O)(=O)c1nnc(NS(=O)(=O)c2ccc(NC(=S)NN3CCOCC3)cc2)s1