Reaction Details
TargetCarbonic anhydrase
LigandBDBM10871
Substrate/Competitorn/a
Meas. Tech.ChEMBL_303240 (CHEMBL827205)
Ki 180±n/a nM
Citation Zimmerman, SInnocenti, ACasini, AFerry, JGScozzafava, ASupuran, CT Carbonic anhydrase inhibitors. Inhibition of the prokariotic beta and gamma-class enzymes from Archaea with sulfonamides. Bioorg Med Chem Lett14:6001-6 (2004) 
 
Carbonic anhydrase
Name:Carbonic anhydrase
Type:Protein
Mol. Mass.:26390.56
Organism:Methanosarcina thermophila
Description:P40881
Residue:247
BDBM10871
NameBDBM10871
Synonyms:4-amino-N-[(4-sulfamoylphenyl)methyl]benzene-1-sulfonamide aromatic/heteroaromatic sulfonamide 16
TypeSmall organic molecule
Emp. Form.C13H15N3O4S2
Mol. Mass.341.406
SMILESNc1ccc(cc1)S(=O)(=O)NCc1ccc(cc1)S(N)(=O)=O