Reaction Details
TargetCarbonic anhydrase
LigandBDBM10887
Substrate/Competitorn/a
Meas. Tech.ChEMBL_303344 (CHEMBL840160)
Ki 23500±n/a nM
Citation Zimmerman, SInnocenti, ACasini, AFerry, JGScozzafava, ASupuran, CT Carbonic anhydrase inhibitors. Inhibition of the prokariotic beta and gamma-class enzymes from Archaea with sulfonamides. Bioorg Med Chem Lett14:6001-6 (2004) 
 
Carbonic anhydrase
Name:Carbonic anhydrase
Synonyms:n/a
Type:PROTEIN
Mol. Mass.:19556.84
Organism:Methanobacterium thermoautotrophicum
Description:ChEMBL_1280426
Residue:176
BDBM10887
NameBDBM10887
TypeSmall organic molecule
Emp. Form.C12H21NO8S
Mol. Mass.339.362
SMILESCC1(C)O[C@@H]2CO[C@@]3(COS(N)(=O)=O)OC(C)(C)O[C@H]3[C@@H]2O1