Reaction Details
TargetCarbonic anhydrase
LigandBDBM10864
Substrate/Competitorn/a
Meas. Tech.ChEMBL_303344 (CHEMBL840160)
Ki 77000±n/a nM
Citation Zimmerman, SInnocenti, ACasini, AFerry, JGScozzafava, ASupuran, CT Carbonic anhydrase inhibitors. Inhibition of the prokariotic beta and gamma-class enzymes from Archaea with sulfonamides. Bioorg Med Chem Lett14:6001-6 (2004) 
 
Carbonic anhydrase
Name:Carbonic anhydrase
Synonyms:n/a
Type:PROTEIN
Mol. Mass.:19556.84
Organism:Methanobacterium thermoautotrophicum
Description:ChEMBL_1280426
Residue:176
BDBM10864
NameBDBM10864
TypeSmall organic molecule
Emp. Form.C6H7BrN2O2S
Mol. Mass.251.101
SMILESNc1ccc(cc1Br)S(N)(=O)=O