Reaction Details
TargetCarbonic anhydrase
LigandBDBM10880
Substrate/Competitorn/a
Meas. Tech.ChEMBL_303344 (CHEMBL840160)
Ki 12100±n/a nM
Citation Zimmerman, SInnocenti, ACasini, AFerry, JGScozzafava, ASupuran, CT Carbonic anhydrase inhibitors. Inhibition of the prokariotic beta and gamma-class enzymes from Archaea with sulfonamides. Bioorg Med Chem Lett14:6001-6 (2004) 
 
Carbonic anhydrase
Name:Carbonic anhydrase
Synonyms:n/a
Type:PROTEIN
Mol. Mass.:19556.84
Organism:Methanobacterium thermoautotrophicum
Description:ChEMBL_1280426
Residue:176
BDBM10880
NameBDBM10880
TypeSmall organic molecule
Emp. Form.C4H6N4O3S2
Mol. Mass.222.245
SMILESCC(=O)Nc1nnc(s1)S(N)(=O)=O