Reaction Details
TargetCarbonic anhydrase
LigandBDBM10884
Substrate/Competitorn/a
Meas. Tech.ChEMBL_303239 (CHEMBL827204)
Ki 1710±n/a nM
Citation Zimmerman, SInnocenti, ACasini, AFerry, JGScozzafava, ASupuran, CT Carbonic anhydrase inhibitors. Inhibition of the prokariotic beta and gamma-class enzymes from Archaea with sulfonamides. Bioorg Med Chem Lett14:6001-6 (2004) 
 
Carbonic anhydrase
Name:Carbonic anhydrase
Type:Protein
Mol. Mass.:26390.56
Organism:Methanosarcina thermophila
Description:P40881
Residue:247
BDBM10884
NameBDBM10884
Synonyms:(2S,4S)-4-(ethylamino)-2-methyl-1,1-dioxo-2H,3H,4H-1,7-thieno[2,3-b]thiopyran-6-sulfonamide Dorzolamide (DZA)
TypeSmall organic molecule
Emp. Form.C10H16N2O4S3
Mol. Mass.324.44
SMILESCCN[C@H]1C[C@H](C)S(=O)(=O)c2sc(cc12)S(N)(=O)=O