Reaction Details
TargetPeroxisome proliferator-activated receptor alpha
LigandBDBM50145712
Substrate/Competitorn/a
Meas. Tech.ChEMBL_306030 (CHEMBL829956)
IC50 42±n/a nM
Citation Wang, MWinneroski, LLArdecky, RJBabine, REBrooks, DAEtgen, GJHutchison, DRKauffman, RFKunkel, AMais, DEMontrose-Rafizadeh, COgilvie, KMOldham, BAPeters, MKRito, CJRungta, DKTripp, AEWilson, SBXu, YZink, RWMcCarthy, JR Conversion of human-selective PPARalpha agonists to human/mouse dual agonists: a molecular modeling analysis. Bioorg Med Chem Lett14:6113-6 (2004) 
 
Peroxisome proliferator-activated receptor alpha
Name:Peroxisome proliferator-activated receptor alpha
Type:Enzyme
Mol. Mass.:52222.08
Organism:Homo sapiens (Human)
Description:Q07869
Residue:468
BDBM50145712
NameBDBM50145712
Synonyms:2-Methyl-3-{4-[2-(5-methyl-2-phenyl-oxazol-4-yl)-ethoxy]-phenyl}-2-phenoxy-propionic acid | CHEMBL82034
TypeSmall organic molecule
Emp. Form.C28H27NO5
Mol. Mass.457.5177
SMILESCc1oc(nc1CCOc1ccc(CC(C)(Oc2ccccc2)C(O)=O)cc1)-c1ccccc1