Reaction Details
TargetKappa-type opioid receptor
LigandBDBM50166715
Substrate/Competitorn/a
Meas. Tech.ChEMBL_304461 (CHEMBL832509)
EC50 6.2±n/a nM
Citation Béguin, CRichards, MRWang, YChen, YLiu-Chen, LYMa, ZLee, DYCarlezon, WACohen, BM Synthesis and in vitro pharmacological evaluation of salvinorin A analogues modified at C(2). Bioorg Med Chem Lett15:2761-5 (2005) 
 
Kappa-type opioid receptor
Name:Kappa-type opioid receptor
Type:G Protein-Coupled Receptor (GPCR)
Mol. Mass.:42648.76
Organism:Homo sapiens (Human)
Description:P41145
Residue:380
BDBM50166715
NameBDBM50166715
Synonyms:(3S,4aR,6S,8R,8aR)-6-Carbamoyloxy-3-furan-3-yl-4a,8a-dimethyl-1,5-dioxo-dodecahydro-2-oxa-phenanthrene-8-carboxylic acid methyl ester | CHEMBL371079
TypeSmall organic molecule
Emp. Form.C22H27NO8
Mol. Mass.433.4517
SMILESCOC(=O)[C@@H]1C[C@H](OC(N)=O)C(=O)C2[C@@]1(C)CCC1C(=O)O[C@@H](C[C@]21C)c1ccoc1