Reaction Details
TargetKappa-type opioid receptor
LigandBDBM50166723
Substrate/Competitorn/a
Meas. Tech.ChEMBL_303392 (CHEMBL839963)
Ki 7.9±n/a nM
Citation Béguin, CRichards, MRWang, YChen, YLiu-Chen, LYMa, ZLee, DYCarlezon, WACohen, BM Synthesis and in vitro pharmacological evaluation of salvinorin A analogues modified at C(2). Bioorg Med Chem Lett15:2761-5 (2005) 
 
Kappa-type opioid receptor
Name:Kappa-type opioid receptor
Type:G Protein-Coupled Receptor (GPCR)
Mol. Mass.:42648.76
Organism:Homo sapiens (Human)
Description:P41145
Residue:380
BDBM50166723
NameBDBM50166723
Synonyms:(3S,4aR,6S,8R,8aR)-6-Ethoxy-3-furan-3-yl-4a,8a-dimethyl-1,5-dioxo-dodecahydro-2-oxa-phenanthrene-8-carboxylic acid methyl ester | CHEMBL193787
TypeSmall organic molecule
Emp. Form.C23H30O7
Mol. Mass.418.4801
SMILESCCO[C@H]1C[C@@H](C(=O)OC)[C@]2(C)CCC3C(=O)O[C@@H](C[C@]3(C)C2C1=O)c1ccoc1