Reaction Details
TargetProthrombin
LigandBDBM50292184
Substrate/Competitorn/a
Meas. Tech.ChEMBL_302401 (CHEMBL829646)
Ki 1.5±n/a nM
Citation Nantermet, PGBurgey, CSRobinson, KAPellicore, JMNewton, CLDeng, JZSelnick, HGLewis, SDLucas, BJKrueger, JAMiller-Stein, CWhite, RBWong, BMcMasters, DRWallace, AALynch, JJYan, YChen, ZKuo, LGardell, SJShafer, JAVacca, JPLyle, TA P2 pyridine N-oxide thrombin inhibitors: a novel peptidomimetic scaffold. Bioorg Med Chem Lett15:2771-5 (2005) 
 
Prothrombin
Name:Prothrombin
Type:Protein
Mol. Mass.:70029.57
Organism:Homo sapiens (Human)
Description:P00734
Residue:622
BDBM50292184
NameBDBM50292184
Synonyms:2-[3-Cyano-6-(2,2-difluoro-2-pyridin-2-yl-ethylamino)-1-oxy-pyridin-2-yl]-N-(3-fluoro-pyridin-2-ylmethyl)-acetamide | CHEMBL371309
TypeSmall organic molecule
Emp. Form.C21H17F3N6O2
Mol. Mass.442.3939
SMILES[O-][n+]1c(NCC(F)(F)c2ccccn2)ccc(C#N)c1CC(=O)NCc1ncccc1F