Reaction Details
TargetProthrombin
LigandBDBM50292187
Substrate/Competitorn/a
Meas. Tech.ChEMBL_302401 (CHEMBL829646)
Ki 0.23±n/a nM
Citation Nantermet, PGBurgey, CSRobinson, KAPellicore, JMNewton, CLDeng, JZSelnick, HGLewis, SDLucas, BJKrueger, JAMiller-Stein, CWhite, RBWong, BMcMasters, DRWallace, AALynch, JJYan, YChen, ZKuo, LGardell, SJShafer, JAVacca, JPLyle, TA P2 pyridine N-oxide thrombin inhibitors: a novel peptidomimetic scaffold. Bioorg Med Chem Lett15:2771-5 (2005) 
 
Prothrombin
Name:Prothrombin
Type:Protein
Mol. Mass.:70029.57
Organism:Homo sapiens (Human)
Description:P00734
Residue:622
BDBM50292187
NameBDBM50292187
Synonyms:2-[3-Cyano-6-(2,2-difluoro-2-pyridin-2-yl-ethylamino)-1-oxy-pyridin-2-yl]-N-(3-[1,2,4]triazol-1-yl-pyridin-2-ylmethyl)-acetamide | CHEMBL194120
TypeSmall organic molecule
Emp. Form.C23H21F2N9O2
Mol. Mass.493.4687
SMILESON1C(CCC(C#N)=C1CC(=O)NCc1ncccc1-n1cncn1)=NCC(F)(F)c1ccccn1