Reaction Details
TargetProthrombin
LigandBDBM50292192
Substrate/Competitorn/a
Meas. Tech.ChEMBL_302401 (CHEMBL829646)
Ki 0.42±n/a nM
Citation Nantermet, PGBurgey, CSRobinson, KAPellicore, JMNewton, CLDeng, JZSelnick, HGLewis, SDLucas, BJKrueger, JAMiller-Stein, CWhite, RBWong, BMcMasters, DRWallace, AALynch, JJYan, YChen, ZKuo, LGardell, SJShafer, JAVacca, JPLyle, TA P2 pyridine N-oxide thrombin inhibitors: a novel peptidomimetic scaffold. Bioorg Med Chem Lett15:2771-5 (2005) 
 
Prothrombin
Name:Prothrombin
Type:Protein
Mol. Mass.:70029.57
Organism:Homo sapiens (Human)
Description:P00734
Residue:622
BDBM50292192
NameBDBM50292192
Synonyms:1-(3-Chloro-benzylamino)-2-[3-chloro-6-(2,2-difluoro-2-pyridin-2-yl-ethylamino)-1-oxy-pyridin-2-yl]-ethanol | CHEMBL195776
TypeSmall organic molecule
Emp. Form.C21H20Cl2F2N4O2
Mol. Mass.469.312
SMILESOC(Cc1c(Cl)ccc(NCC(F)(F)c2ccccn2)[n+]1[O-])NCc1cccc(Cl)c1