Reaction Details
TargetProthrombin
LigandBDBM50292201
Substrate/Competitorn/a
Meas. Tech.ChEMBL_302401 (CHEMBL829646)
Ki 0.14±n/a nM
Citation Nantermet, PGBurgey, CSRobinson, KAPellicore, JMNewton, CLDeng, JZSelnick, HGLewis, SDLucas, BJKrueger, JAMiller-Stein, CWhite, RBWong, BMcMasters, DRWallace, AALynch, JJYan, YChen, ZKuo, LGardell, SJShafer, JAVacca, JPLyle, TA P2 pyridine N-oxide thrombin inhibitors: a novel peptidomimetic scaffold. Bioorg Med Chem Lett15:2771-5 (2005) 
 
Prothrombin
Name:Prothrombin
Type:Protein
Mol. Mass.:70029.57
Organism:Homo sapiens (Human)
Description:P00734
Residue:622
BDBM50292201
NameBDBM50292201
Synonyms:CHEMBL372367 | N-(5-Chloro-2-tetrazol-1-yl-benzyl)-2-[6-(2,2-difluoro-2-pyridin-2-yl-ethylamino)-1-oxy-pyridin-2-yl]-acetamide
TypeSmall organic molecule
Emp. Form.C22H21ClF2N8O2
Mol. Mass.502.904
SMILESON1C(CC(=O)NCc2cc(Cl)ccc2-n2cnnn2)=CCCC1=NCC(F)(F)c1ccccn1