Reaction Details
TargetDual specificity calcium/calmodulin-dependent 3',5'-cyclic nucleotide phosphodiesterase 1A/1B
LigandBDBM50166817
Substrate/Competitorn/a
Meas. Tech.ChEMBL_305208 (CHEMBL832461)
IC50>100000±n/a nM
Citation Xia, GLi, JPeng, ALai, SZhang, SShen, JLiu, ZChen, XJi, R Synthesis and phosphodiesterase 5 inhibitory activity of novel pyrido[1,2-e]purin-4(3H)-one derivatives. Bioorg Med Chem Lett15:2790-4 (2005) 
 
Dual specificity calcium/calmodulin-dependent 3',5'-cyclic nucleotide phosphodiesterase 1A/1B
Name:Dual specificity calcium/calmodulin-dependent 3',5'-cyclic nucleotide phosphodiesterase 1A/1B
Synonyms:Phosphodiesterase 1
Type:n/a
Mol. Mass.:n/a
Description:ASSAY_ID of ChEMBL is 156011
Components:This complex has 2 components.
Component 1
Name:Dual specificity calcium/calmodulin-dependent 3',5'-cyclic nucleotide phosphodiesterase 1B
Type:PROTEIN
Mol. Mass.:60991.90
Organism:Bos taurus
Description:ChEMBL_104913
Residue:534
Component 2
Name:Dual specificity calcium/calmodulin-dependent 3',5'-cyclic nucleotide phosphodiesterase 1A
Synonyms:Calcium/calmodulin-dependent 3',5'-cyclic nucleotide phosphodiesterase 1A PDE1A Phosphodiesterase 1 | Phosphodiesterase 1A
Type:Enzyme Catalytic Domain
Mol. Mass.:60835.05
Organism:BOVINE
Description:Phosphodiesterase 1 0 BOVINE::P14100
Residue:530
BDBM50166817
NameBDBM50166817
Synonyms:3-[2-Ethoxy-5-(4-ethyl-piperazine-1-sulfonyl)-phenyl]-5-methyl-2H-2,4,4b,9-tetraaza-fluoren-1-one | CHEMBL426650
TypeSmall organic molecule
Emp. Form.C24H28N6O4S
Mol. Mass.496.582
SMILESCCOc1ccc(cc1-c1nc2c(nc3cccc(C)n23)c(=O)[nH]1)S(=O)(=O)N1CCN(CC)CC1