Reaction Details
TargetMelanocortin receptor 4
LigandBDBM50119368
Substrate/Competitorn/a
Meas. Tech.ChEMBL_302572 (CHEMBL839533)
Ki 9±n/a nM
Citation Tian, XField, TMazur, AWEbetino, FHWos, JACrossdoersen, DPinney, BBSheldon, RJ Design, synthesis, and evaluation of proline based melanocortin receptor ligands. Bioorg Med Chem Lett15:2819-23 (2005) 
 
Melanocortin receptor 4
Name:Melanocortin receptor 4
Type:Enzyme
Mol. Mass.:36949.50
Organism:Homo sapiens (Human)
Description:P32245
Residue:332
BDBM50119368
NameBDBM50119368
Synonyms:(R)-1,2,3,4-Tetrahydro-isoquinoline-3-carboxylic acid [(R)-1-(4-chloro-benzyl)-2-(4-cyclohexyl-4-[1,2,4]triazol-1-ylmethyl-piperidin-1-yl)-2-oxo-ethyl]-amide (R)-N-((R)-1-(4-((1H-1,2,4-triazol-1-yl)methyl)-4-cyclohexylpiperidin-1-yl)-3-(4-chlorophenyl)-1-oxopropan-2-yl)-1,2,3,4-tetrahydroisoquinoline-3-carboxamide 1,2,3,4-Tetrahydro-isoquinoline-3-carboxylic acid [1-(4-chloro-benzyl)-2-(4-cyclohexyl-4-[1,2,4]triazol-1-ylmethyl-piperidin-1-yl)-2-oxo-ethyl]-amide THIQ
TypeSmall organic molecule
Emp. Form.C33H41ClN6O2
Mol. Mass.589.171
SMILESClc1ccc(C[C@@H](NC(=O)[C@H]2Cc3ccccc3CN2)C(=O)N2CCC(Cn3cncn3)(CC2)C2CCCCC2)cc1