Reaction Details
TargetAdenosine receptor A2b
LigandBDBM50166742
Substrate/Competitorn/a
Meas. Tech.ChEMBL_303806 (CHEMBL829027)
Ki 20±n/a nM
Citation Press, NJTaylor, RJFullerton, JDTranter, PMcCarthy, CKeller, THBrown, LCheung, RChristie, JHaberthuer, SHatto, JDKeenan, MMercer, MKPress, NESahri, HTuffnell, ARTweed, MFozard, JR A new orally bioavailable dual adenosine A2B/A3 receptor antagonist with therapeutic potential. Bioorg Med Chem Lett15:3081-5 (2005) 
 
Adenosine receptor A2b
Name:Adenosine receptor A2b
Type:G Protein-Coupled Receptor (GPCR)
Mol. Mass.:36341.22
Organism:Homo sapiens (Human)
Description:n/a
Residue:332
BDBM50166742
NameBDBM50166742
Synonyms:3-[2-(3-Methyl-pyridin-2-ylamino)-5-[1,2,4]triazol-1-yl-thiazol-4-yl]-benzonitrile | CHEMBL194132
TypeSmall organic molecule
Emp. Form.C18H13N7S
Mol. Mass.359.408
SMILESCc1cccc(Nc2nc(c(s2)-n2cncn2)-c2cccc(c2)C#N)n1