Reaction Details
TargetAdenosine receptor A1
LigandBDBM50166743
Substrate/Competitorn/a
Meas. Tech.ChEMBL_303729 (CHEMBL829635)
Ki 560±n/a nM
Citation Press, NJTaylor, RJFullerton, JDTranter, PMcCarthy, CKeller, THBrown, LCheung, RChristie, JHaberthuer, SHatto, JDKeenan, MMercer, MKPress, NESahri, HTuffnell, ARTweed, MFozard, JR A new orally bioavailable dual adenosine A2B/A3 receptor antagonist with therapeutic potential. Bioorg Med Chem Lett15:3081-5 (2005) 
 
Adenosine receptor A1
Name:Adenosine receptor A1
Type:G Protein-Coupled Receptor (GPCR)
Mol. Mass.:36520.92
Organism:Homo sapiens (Human)
Description:P30542
Residue:326
BDBM50166743
NameBDBM50166743
Synonyms:3-[5-Imidazol-1-yl-2-(pyridin-3-ylamino)-thiazol-4-yl]-benzonitrile | CHEMBL372182
TypeSmall organic molecule
Emp. Form.C18H12N6S
Mol. Mass.344.393
SMILESN#Cc1cccc(c1)-c1nc(Nc2cccnc2)sc1-n1ccnc1