Reaction Details
TargetAdenosine receptor A1
LigandBDBM50166745
Substrate/Competitorn/a
Meas. Tech.ChEMBL_303729 (CHEMBL829635)
Ki 3780±n/a nM
Citation Press, NJTaylor, RJFullerton, JDTranter, PMcCarthy, CKeller, THBrown, LCheung, RChristie, JHaberthuer, SHatto, JDKeenan, MMercer, MKPress, NESahri, HTuffnell, ARTweed, MFozard, JR A new orally bioavailable dual adenosine A2B/A3 receptor antagonist with therapeutic potential. Bioorg Med Chem Lett15:3081-5 (2005) 
 
Adenosine receptor A1
Name:Adenosine receptor A1
Type:G Protein-Coupled Receptor (GPCR)
Mol. Mass.:36520.92
Organism:Homo sapiens (Human)
Description:P30542
Residue:326
BDBM50166745
NameBDBM50166745
Synonyms:3-[2-(Pyridin-4-ylamino)-5-[1,2,4]triazol-1-yl-thiazol-4-yl]-benzonitrile | CHEMBL365172
TypeSmall organic molecule
Emp. Form.C17H11N7S
Mol. Mass.345.381
SMILESN#Cc1cccc(c1)-c1nc(Nc2ccncc2)sc1-n1cncn1