Reaction Details
TargetAdenosine receptor A2b
LigandBDBM50166745
Substrate/Competitorn/a
Meas. Tech.ChEMBL_303806 (CHEMBL829027)
Ki 62±n/a nM
Citation Press, NJTaylor, RJFullerton, JDTranter, PMcCarthy, CKeller, THBrown, LCheung, RChristie, JHaberthuer, SHatto, JDKeenan, MMercer, MKPress, NESahri, HTuffnell, ARTweed, MFozard, JR A new orally bioavailable dual adenosine A2B/A3 receptor antagonist with therapeutic potential. Bioorg Med Chem Lett15:3081-5 (2005) 
 
Adenosine receptor A2b
Name:Adenosine receptor A2b
Type:G Protein-Coupled Receptor (GPCR)
Mol. Mass.:36341.22
Organism:Homo sapiens (Human)
Description:n/a
Residue:332
BDBM50166745
NameBDBM50166745
Synonyms:3-[2-(Pyridin-4-ylamino)-5-[1,2,4]triazol-1-yl-thiazol-4-yl]-benzonitrile | CHEMBL365172
TypeSmall organic molecule
Emp. Form.C17H11N7S
Mol. Mass.345.381
SMILESN#Cc1cccc(c1)-c1nc(Nc2ccncc2)sc1-n1cncn1