Reaction Details
TargetProstaglandin E2 receptor EP1 subtype
LigandBDBM50167887
Substrate/Competitorn/a
Meas. Tech.ChEMBL_303233 (CHEMBL827198)
Ki 9600±n/a nM
Citation Hattori, KTanaka, AOkitsu, OTabuchi, STaniguchi, KNishio, MKoyama, SHigaki, MSeki, JSakane, K Discovery of diphenylcarbamate derivatives as highly potent and selective IP receptor agonists: orally active prostacyclin mimetics. Part 3. Bioorg Med Chem Lett15:3091-5 (2005) 
 
Prostaglandin E2 receptor EP1 subtype
Name:Prostaglandin E2 receptor EP1 subtype
Type:Enzyme
Mol. Mass.:41834.57
Organism:Homo sapiens (Human)
Description:P34995
Residue:402
BDBM50167887
NameBDBM50167887
Synonyms:(R)-2-(6-((diphenylcarbamoyloxy)methyl)-6-hydroxy-5,6,7,8-tetrahydronaphthalen-1-yloxy)acetic acid {(R)-6-[(Diphenylcarbamoyloxy)-methyl]-6-hydroxy-5,6,7,8-tetrahydro-naphthalen-1-yloxy}-acetic acid
TypeSmall organic molecule
Emp. Form.C26H25NO6
Mol. Mass.447.4798
SMILESOC(=O)COc1cccc2C[C@@](O)(COC(=O)N(c3ccccc3)c3ccccc3)CCc12