Reaction Details
TargetProstaglandin E2 receptor EP3 subtype
LigandBDBM50167891
Substrate/Competitorn/a
Meas. Tech.ChEMBL_303235 (CHEMBL827200)
Ki>1900±n/a nM
Citation Hattori, KTanaka, AOkitsu, OTabuchi, STaniguchi, KNishio, MKoyama, SHigaki, MSeki, JSakane, K Discovery of diphenylcarbamate derivatives as highly potent and selective IP receptor agonists: orally active prostacyclin mimetics. Part 3. Bioorg Med Chem Lett15:3091-5 (2005) 
 
Prostaglandin E2 receptor EP3 subtype
Name:Prostaglandin E2 receptor EP3 subtype
Type:Enzyme
Mol. Mass.:43335.03
Organism:Homo sapiens (Human)
Description:P43115
Residue:390
BDBM50167891
NameBDBM50167891
Synonyms:CHEMBL197319 | {6-[(Diphenylcarbamoyloxy)-methyl]-5,6,7,8-tetrahydro-naphthalen-1-yloxy}-acetic acid
TypeSmall organic molecule
Emp. Form.C26H25NO5
Mol. Mass.431.4804
SMILESOC(=O)COc1cccc2CC(COC(=O)N(c3ccccc3)c3ccccc3)CCc12