Reaction Details
TargetProstaglandin E2 receptor EP2 subtype
LigandBDBM50370452
Substrate/Competitorn/a
Meas. Tech.ChEMBL_303234 (CHEMBL827199)
Ki>1000±n/a nM
Citation Hattori, KTanaka, AOkitsu, OTabuchi, STaniguchi, KNishio, MKoyama, SHigaki, MSeki, JSakane, K Discovery of diphenylcarbamate derivatives as highly potent and selective IP receptor agonists: orally active prostacyclin mimetics. Part 3. Bioorg Med Chem Lett15:3091-5 (2005) 
 
Prostaglandin E2 receptor EP2 subtype
Name:Prostaglandin E2 receptor EP2 subtype
Type:Enzyme
Mol. Mass.:39775.71
Organism:Homo sapiens (Human)
Description:P43116
Residue:358
BDBM50370452
NameBDBM50370452
Synonyms:CHEMBL132589 | FR-181157
TypeSmall organic molecule
Emp. Form.C30H26NO4
Mol. Mass.464.5323
SMILES[O-]C(=O)COc1cccc(C[C@@H]2CCCC=C2c2nc(c(o2)-c2ccccc2)-c2ccccc2)c1