Reaction Details
TargetCarbonic anhydrase 9
LigandBDBM50167348
Substrate/Competitorn/a
Meas. Tech.ChEMBL_302318 (CHEMBL828906)
Ki 1.5±n/a nM
Citation Garaj, VPuccetti, LFasolis, GWinum, JYMontero, JLScozzafava, AVullo, DInnocenti, ASupuran, CT Carbonic anhydrase inhibitors: novel sulfonamides incorporating 1,3,5-triazine moieties as inhibitors of the cytosolic and tumour-associated carbonic anhydrase isozymes I, II and IX. Bioorg Med Chem Lett15:3102-8 (2005) 
 
Carbonic anhydrase 9
Name:Carbonic anhydrase 9
Type:Enzyme
Mol. Mass.:49669.03
Organism:Homo sapiens (Human)
Description:Catalytic domain of human cloned isozyme was used in the assay
Residue:459
BDBM50167348
NameBDBM50167348
Synonyms:4-(4,6-Bis-dimethylamino-[1,3,5]triazin-2-ylamino)-benzenesulfonamide | CHEMBL190023
TypeSmall organic molecule
Emp. Form.C13H19N7O2S
Mol. Mass.337.401
SMILESCN(C)c1nc(Nc2ccc(cc2)S(N)(=O)=O)nc(n1)N(C)C