Reaction Details
TargetCarbonic anhydrase 1
LigandBDBM50167355
Substrate/Competitorn/a
Meas. Tech.ChEMBL_302302 (CHEMBL827063)
Ki 33±n/a nM
Citation Garaj, VPuccetti, LFasolis, GWinum, JYMontero, JLScozzafava, AVullo, DInnocenti, ASupuran, CT Carbonic anhydrase inhibitors: novel sulfonamides incorporating 1,3,5-triazine moieties as inhibitors of the cytosolic and tumour-associated carbonic anhydrase isozymes I, II and IX. Bioorg Med Chem Lett15:3102-8 (2005) 
 
Carbonic anhydrase 1
Name:Carbonic anhydrase 1
Type:Enzyme
Mol. Mass.:28873.37
Organism:Homo sapiens (Human)
Description:P00915
Residue:261
BDBM50167355
NameBDBM50167355
Synonyms:CHEMBL189526 | {4-Chloro-6-[2-(4-sulfamoyl-phenyl)-ethylamino]-[1,3,5]triazin-2-ylamino}-acetic acid
TypeSmall organic molecule
Emp. Form.C13H15ClN6O4S
Mol. Mass.386.814
SMILESNS(=O)(=O)c1ccc(CCNc2nc(Cl)nc(NCC(O)=O)n2)cc1