Reaction Details
TargetCarbonic anhydrase 9
LigandBDBM50167342
Substrate/Competitorn/a
Meas. Tech.ChEMBL_302318 (CHEMBL828906)
Ki 2.9±n/a nM
Citation Garaj, VPuccetti, LFasolis, GWinum, JYMontero, JLScozzafava, AVullo, DInnocenti, ASupuran, CT Carbonic anhydrase inhibitors: novel sulfonamides incorporating 1,3,5-triazine moieties as inhibitors of the cytosolic and tumour-associated carbonic anhydrase isozymes I, II and IX. Bioorg Med Chem Lett15:3102-8 (2005) 
 
Carbonic anhydrase 9
Name:Carbonic anhydrase 9
Type:Enzyme
Mol. Mass.:49669.03
Organism:Homo sapiens (Human)
Description:Catalytic domain of human cloned isozyme was used in the assay
Residue:459
BDBM50167342
NameBDBM50167342
Synonyms:4-[2-(4,6-Bis-ethylamino-[1,3,5]triazin-2-ylamino)-ethyl]-benzenesulfonamide | CHEMBL364919
TypeSmall organic molecule
Emp. Form.C15H23N7O2S
Mol. Mass.365.454
SMILESCCNc1nc(NCC)nc(NCCc2ccc(cc2)S(N)(=O)=O)n1