Reaction Details
Target5-hydroxytryptamine receptor 6
LigandBDBM50169601
Substrate/Competitorn/a
Meas. Tech.ChEMBL_302678 (CHEMBL839441)
Ki 1.7±n/a nM
Citation Abate, CKolanos, RDukat, MSetola, VRoth, BLGlennon, RA Interaction of chiral MS-245 analogs at h5-HT6 receptors. Bioorg Med Chem Lett15:3510-3 (2005) 
 
5-hydroxytryptamine receptor 6
Name:5-hydroxytryptamine receptor 6
Type:G Protein-Coupled Receptor (GPCR)
Mol. Mass.:46968.43
Organism:Homo sapiens (Human)
Description:P50406
Residue:440
BDBM50169601
NameBDBM50169601
Synonyms:1-Benzenesulfonyl-3-((S)-1-methyl-pyrrolidin-2-ylmethyl)-1H-indole; oxalic acid CHEMBL373107
TypeSmall organic molecule
Emp. Form.C20H22N2O2S
Mol. Mass.354.466
SMILESCN1CCC[C@H]1Cc1cn(c2ccccc12)S(=O)(=O)c1ccccc1