Reaction Details
TargetSphingosine 1-phosphate receptor 4
LigandBDBM50169452
Substrate/Competitorn/a
Meas. Tech.ChEMBL_304308 (CHEMBL830103)
EC50 7400±n/a nM
Citation Clemens, JJDavis, MDLynch, KRMacdonald, TL Synthesis of 4(5)-phenylimidazole-based analogues of sphingosine-1-phosphate and FTY720: discovery of potent S1P1 receptor agonists. Bioorg Med Chem Lett15:3568-72 (2005) 
 
Sphingosine 1-phosphate receptor 4
Name:Sphingosine 1-phosphate receptor 4
Type:G Protein-Coupled Receptor (GPCR)
Mol. Mass.:41647.39
Organism:Homo sapiens (Human)
Description:n/a
Residue:384
BDBM50169452
NameBDBM50169452
Synonyms:(S)-2-Amino-2-[5-(4-octyl-phenyl)-1H-imidazol-2-yl]-ethanol; TFA | CHEMBL190529
TypeSmall organic molecule
Emp. Form.C19H29N3O
Mol. Mass.315.4531
SMILESCCCCCCCCc1ccc(cc1)-c1c[nH]c(n1)[C@H](N)CO