Reaction Details
TargetSphingosine 1-phosphate receptor 4
LigandBDBM50169456
Substrate/Competitorn/a
Meas. Tech.ChEMBL_304308 (CHEMBL830103)
EC50 660±n/a nM
Citation Clemens, JJDavis, MDLynch, KRMacdonald, TL Synthesis of 4(5)-phenylimidazole-based analogues of sphingosine-1-phosphate and FTY720: discovery of potent S1P1 receptor agonists. Bioorg Med Chem Lett15:3568-72 (2005) 
 
Sphingosine 1-phosphate receptor 4
Name:Sphingosine 1-phosphate receptor 4
Type:G Protein-Coupled Receptor (GPCR)
Mol. Mass.:41647.39
Organism:Homo sapiens (Human)
Description:n/a
Residue:384
BDBM50169456
NameBDBM50169456
Synonyms:2-Amino-2-[5-(4-octyl-phenyl)-1H-imidazol-2-yl]-propane-1,3-diol; hydrochloride | CHEMBL537632
TypeSmall organic molecule
Emp. Form.C20H31N3O2
Mol. Mass.345.479
SMILESCCCCCCCCc1ccc(cc1)-c1c[nH]c(n1)C(N)(CO)CO