Reaction Details
TargetSphingosine 1-phosphate receptor 1
LigandBDBM23163
Substrate/Competitorn/a
Meas. Tech.ChEMBL_304296 (CHEMBL830091)
EC50 1.3±n/a nM
Citation Clemens, JJDavis, MDLynch, KRMacdonald, TL Synthesis of 4(5)-phenylimidazole-based analogues of sphingosine-1-phosphate and FTY720: discovery of potent S1P1 receptor agonists. Bioorg Med Chem Lett15:3568-72 (2005) 
 
Sphingosine 1-phosphate receptor 1
Name:Sphingosine 1-phosphate receptor 1
Type:Enzyme
Mol. Mass.:42836.02
Organism:Homo sapiens (Human)
Description:P21453
Residue:382
BDBM23163
NameBDBM23163
Synonyms:CHEMBL114606 {2-amino-3-hydroxy-2-[2-(4-octylphenyl)ethyl]propoxy}phosphonic acid
TypeSmall organic molecule
Emp. Form.C19H34NO5P
Mol. Mass.387.4507
SMILESCCCCCCCCc1ccc(CCC(N)(CO)COP(O)(O)=O)cc1