Reaction Details
TargetSphingosine 1-phosphate receptor 5
LigandBDBM50169461
Substrate/Competitorn/a
Meas. Tech.ChEMBL_304309 (CHEMBL830104)
EC50 37±n/a nM
Citation Clemens, JJDavis, MDLynch, KRMacdonald, TL Synthesis of 4(5)-phenylimidazole-based analogues of sphingosine-1-phosphate and FTY720: discovery of potent S1P1 receptor agonists. Bioorg Med Chem Lett15:3568-72 (2005) 
 
Sphingosine 1-phosphate receptor 5
Name:Sphingosine 1-phosphate receptor 5
Type:G Protein-Coupled Receptor (GPCR)
Mol. Mass.:41796.42
Organism:Homo sapiens (Human)
Description:n/a
Residue:398
BDBM50169461
NameBDBM50169461
Synonyms:CHEMBL187712 | Phosphoric acid mono-{(S)-2-amino-2-[5-(4-octyl-phenyl)-1H-imidazol-2-yl]-ethyl} ester; TFA
TypeSmall organic molecule
Emp. Form.C19H30N3O4P
Mol. Mass.395.433
SMILESCCCCCCCCc1ccc(cc1)-c1c[nH]c(n1)[C@H](N)COP(O)(O)=O