Reaction Details
TargetKappa-type opioid receptor
LigandBDBM50169773
Substrate/Competitorn/a
Meas. Tech.ChEMBL_302641 (CHEMBL876690)
Ki>1000±n/a nM
Citation Lee, DYKarnati, VVHe, MLiu-Chen, LYKondaveti, LMa, ZWang, YChen, YBeguin, CCarlezon, WACohen, B Synthesis and in vitro pharmacological studies of new C(2) modified salvinorin A analogues. Bioorg Med Chem Lett15:3744-7 (2005) 
 
Kappa-type opioid receptor
Name:Kappa-type opioid receptor
Type:G Protein-Coupled Receptor (GPCR)
Mol. Mass.:42648.76
Organism:Homo sapiens (Human)
Description:P41145
Residue:380
BDBM50169773
NameBDBM50169773
Synonyms:(3S,4aR,6S,8R,8aR,10aR)-3-Furan-3-yl-4a,8a-dimethyl-1,5-dioxo-6-propionyloxy-dodecahydro-2-oxa-phenanthrene-8-carboxylic acid methyl ester | CHEMBL360495
TypeSmall organic molecule
Emp. Form.C24H30O8
Mol. Mass.446.4902
SMILESCCC(=O)O[C@H]1C[C@@H](C(=O)OC)[C@]2(C)CC[C@H]3C(=O)O[C@@H](C[C@]3(C)C2C1=O)c1ccoc1