Reaction Details
TargetCarbonic anhydrase 2
LigandBDBM50171009
Substrate/Competitorn/a
Meas. Tech.ChEMBL_302944 (CHEMBL841779)
Ki 11±n/a nM
Citation Mincione, FStarnotti, MMasini, EBacciottini, LScrivanti, CCasini, AVullo, DScozzafava, ASupuran, CT Carbonic anhydrase inhibitors: design of thioureido sulfonamides with potent isozyme II and XII inhibitory properties and intraocular pressure lowering activity in a rabbit model of glaucoma. Bioorg Med Chem Lett15:3821-7 (2005) 
 
Carbonic anhydrase 2
Name:Carbonic anhydrase 2
Type:Enzyme
Mol. Mass.:29250.71
Organism:Homo sapiens (Human)
Description:P00918
Residue:260
BDBM50171009
NameBDBM50171009
Synonyms:(3R)-3-{2-[({2-[4-(aminosulfonyl)phenyl]ethyl}amino)carbonothioyl]hydrazino}-4-oxobutanamide | CHEMBL181422
TypeSmall organic molecule
Emp. Form.C13H19N5O4S2
Mol. Mass.373.451
SMILESNC(CC(N)=O)C(=O)NC(=S)NCCc1ccc(cc1)S(N)(=O)=O