Reaction Details
TargetCarbonic anhydrase 12
LigandBDBM50171015
Substrate/Competitorn/a
Meas. Tech.ChEMBL_303378 (CHEMBL877449)
Ki 10±n/a nM
Citation Mincione, FStarnotti, MMasini, EBacciottini, LScrivanti, CCasini, AVullo, DScozzafava, ASupuran, CT Carbonic anhydrase inhibitors: design of thioureido sulfonamides with potent isozyme II and XII inhibitory properties and intraocular pressure lowering activity in a rabbit model of glaucoma. Bioorg Med Chem Lett15:3821-7 (2005) 
 
Carbonic anhydrase 12
Name:Carbonic anhydrase 12
Type:Enzyme
Mol. Mass.:39456.00
Organism:Homo sapiens (Human)
Description:Catalytic domain of human cloned isozyme was used in the assay
Residue:354
BDBM50171015
NameBDBM50171015
Synonyms:CHEMBL182135 | N-[4-(aminosulfonyl)phenyl]-2-(2-morpholin-4-ylethyl)hydrazinecarbothioamide
TypeSmall organic molecule
Emp. Form.C13H21N5O3S2
Mol. Mass.359.468
SMILESNS(=O)(=O)c1ccc(NC(=S)NNCCN2CCOCC2)cc1