Reaction Details
TargetCarbonic anhydrase 2
LigandBDBM50171024
Substrate/Competitorn/a
Meas. Tech.ChEMBL_302944 (CHEMBL841779)
Ki 18±n/a nM
Citation Mincione, FStarnotti, MMasini, EBacciottini, LScrivanti, CCasini, AVullo, DScozzafava, ASupuran, CT Carbonic anhydrase inhibitors: design of thioureido sulfonamides with potent isozyme II and XII inhibitory properties and intraocular pressure lowering activity in a rabbit model of glaucoma. Bioorg Med Chem Lett15:3821-7 (2005) 
 
Carbonic anhydrase 2
Name:Carbonic anhydrase 2
Type:Enzyme
Mol. Mass.:29250.71
Organism:Homo sapiens (Human)
Description:P00918
Residue:260
BDBM50171024
NameBDBM50171024
Synonyms:CHEMBL361955 | N-{2-[4-(aminosulfonyl)phenyl]ethyl}-2-(pentafluorophenyl)hydrazinecarbothioamide
TypeSmall organic molecule
Emp. Form.C15H13F5N4O2S2
Mol. Mass.440.411
SMILESNS(=O)(=O)c1ccc(CCNC(=S)NNc2c(F)c(F)c(F)c(F)c2F)cc1