Reaction Details
TargetCarbonic anhydrase 1
LigandBDBM50171015
Substrate/Competitorn/a
Meas. Tech.ChEMBL_302924 (CHEMBL830383)
Ki 73±n/a nM
Citation Mincione, FStarnotti, MMasini, EBacciottini, LScrivanti, CCasini, AVullo, DScozzafava, ASupuran, CT Carbonic anhydrase inhibitors: design of thioureido sulfonamides with potent isozyme II and XII inhibitory properties and intraocular pressure lowering activity in a rabbit model of glaucoma. Bioorg Med Chem Lett15:3821-7 (2005) 
 
Carbonic anhydrase 1
Name:Carbonic anhydrase 1
Type:Enzyme
Mol. Mass.:28873.37
Organism:Homo sapiens (Human)
Description:P00915
Residue:261
BDBM50171015
NameBDBM50171015
Synonyms:CHEMBL182135 | N-[4-(aminosulfonyl)phenyl]-2-(2-morpholin-4-ylethyl)hydrazinecarbothioamide
TypeSmall organic molecule
Emp. Form.C13H21N5O3S2
Mol. Mass.359.468
SMILESNS(=O)(=O)c1ccc(NC(=S)NNCCN2CCOCC2)cc1