Reaction Details
TargetCarbonic anhydrase 1
LigandBDBM50171018
Substrate/Competitorn/a
Meas. Tech.ChEMBL_302924 (CHEMBL830383)
Ki 113±n/a nM
Citation Mincione, FStarnotti, MMasini, EBacciottini, LScrivanti, CCasini, AVullo, DScozzafava, ASupuran, CT Carbonic anhydrase inhibitors: design of thioureido sulfonamides with potent isozyme II and XII inhibitory properties and intraocular pressure lowering activity in a rabbit model of glaucoma. Bioorg Med Chem Lett15:3821-7 (2005) 
 
Carbonic anhydrase 1
Name:Carbonic anhydrase 1
Type:Enzyme
Mol. Mass.:28873.37
Organism:Homo sapiens (Human)
Description:P00915
Residue:261
BDBM50171018
NameBDBM50171018
Synonyms:4-(2-{3-[2-Hydroxy-1-hydroxymethyl-2-(4-nitro-phenyl)-ethyl]-thioureido}-ethyl)-benzenesulfonamide | CHEMBL178603
TypeSmall organic molecule
Emp. Form.C18H22N4O6S2
Mol. Mass.454.52
SMILESNS(=O)(=O)c1ccc(CC[N-]C(=[SH+])NC(CO)C(O)c2ccc(cc2)[N+]([O-])=O)cc1