Reaction Details
TargetCarbonic anhydrase 9
LigandBDBM10876
Substrate/Competitorn/a
Meas. Tech.ChEMBL_303196 (CHEMBL829822)
Ki 21±n/a nM
Citation Nishimori, IVullo, DInnocenti, AScozzafava, AMastrolorenzo, ASupuran, CT Carbonic anhydrase inhibitors: inhibition of the transmembrane isozyme XIV with sulfonamides. Bioorg Med Chem Lett15:3828-33 (2005) 
 
Carbonic anhydrase 9
Name:Carbonic anhydrase 9
Type:Enzyme
Mol. Mass.:49669.03
Organism:Homo sapiens (Human)
Description:Catalytic domain of human cloned isozyme was used in the assay
Residue:459
BDBM10876
NameBDBM10876
Synonyms:4-(hydroxymethyl)benzene-1-sulfonamide JMC522226 Compound 20 aromatic/heteroaromatic sulfonamide 21
TypeSmall organic molecule
Emp. Form.C7H9NO3S
Mol. Mass.187.216
SMILESNS(=O)(=O)c1ccc(CO)cc1